Target
SUMO-activating enzyme subunit 2
Ligand
BDBM329903
Substrate
Meas. Tech.
HTRF Assay
IC50
<10±n/a nM
Citation
 Afroze, RBharathan, ITCiavarri, JPFleming, PEGaulin, JLGirard, MLangston, SPSoucy, FWong, TYe, Y Pyrazolopyrimidinyl inhibitors of ubiquitin-activating enzyme US Patent  US9796725 Publication Date 10/24/2017 
Target
Name:
SUMO-activating enzyme subunit 2
Synonyms:
6.3.2.- SAE2 SUMO-activating enzyme subunit 2 UBA2 Ubiquitin-like 1-activating enzyme E1B | Ubiquitin-like modifier-activating enzyme 2
Type:
Enzyme
Mol. Mass.:
71206.17
Organism:
Homo sapiens (Human)
Description:
Q9UBT2
Residue:
640
  
Inhibitor
Name:
BDBM329903
Synonyms:
(s.e.)-((1R,2R,3S,4R)-4-(2-(6-(difluoromethyl)naphthalen-1-yl)pyrazolo[1,5- US9663525, Compound I-111 | US9796725, Compound I-111
Type:
Small organic molecule
Emp. Form.:
C23H23F2N5O5S
Mol. Mass.:
519.521
SMILES:
NS(=O)(=O)OC[C@H]1C[C@@H](Nc2ccnc3cc(nn23)-c2cccc3cc(ccc23)C(F)F)[C@H](O)[C@@H]1O
: