Target
cAMP-dependent protein kinase catalytic subunit alpha
Ligand
BDBM16591
Substrate
Kemptide
Meas. Tech.
Kinase assays for IC50 determinations
pH
7.5±n/a
Temperature
303.15±n/a K
IC50
190±n/a nM
Citation
 Foloppe, NFisher, LMFrancis, GHowes, RKierstan, PPotter, A Identification of a buried pocket for potent and selective inhibition of Chk1: prediction and verification. Bioorg Med Chem 14:1792-804 (2006)  
Target
Name:
cAMP-dependent protein kinase catalytic subunit alpha
Synonyms:
KAPCA_HUMAN PKACA cAMP-dependent protein kinase (PKA) cAMP-dependent protein kinase catalytic subunit alpha cAMP-dependent protein kinase catalytic subunit alpha (PKACA) cAMP-dependent protein kinase catalytic subunit alpha isoform 1 | cAMP-dependent protein kinase, alpha-catalytic subunit
Type:
Enzyme Catalytic Subunit
Mol. Mass.:
40598.73
Organism:
Homo sapiens (Human)
Description:
Residue:
351
  
Inhibitor
Name:
BDBM16591
Synonyms:
(4Z)-4-(2-amino-5-oxo-3,5-dihydro-4H-imidazol-4-ylidene)-4,5,6,7-tetrahydropyrrolo[2,3-c]azepin-8(1H)-one B722657K110 Debromohymenialdisine (DBH) NSC607174
Type:
Small organic molecule
Emp. Form.:
C11H11N5O2
Mol. Mass.:
245.2373
SMILES:
NC1=NC(=O)C(N1)=C1CCNC(=O)c2[nH]ccc12
:
Substrate
Name:
Kemptide
Synonyms:
Aurora Peptide Substrate
Type:
Peptide
Mol. Mass.:
773.92
Organism:
Description:
50 uM ATP as co-substrate.
Residue:
7
LRRASLG