Target
Complement factor D
Ligand
BDBM353069
Substrate
Meas. Tech.
Factor D Assay
IC50
<1000±n/a nM
Citation
 Gadhachanda, VRWang, QPais, GHashimoto, AChen, DWang, XAgarwal, ADeshpande, MWiles, JAPhadke, AS Aryl, heteroaryl, and heterocyclic compounds for treatment of complement mediated disorders US Patent  US9796741 Publication Date 10/24/2017 
Target
Name:
Complement factor D
Synonyms:
Adipsin CFAD_HUMAN DF Properdin factor D
Type:
Protein
Mol. Mass.:
27039.19
Organism:
Homo sapiens (Human)
Description:
P00746
Residue:
253
  
Inhibitor
Name:
BDBM353069
Synonyms:
(2S,4R)-1-(2-(3-acetyl- 5-(4-(methylsulfonyl) piperazin-1-yl)-1H- indol-1-yl)acetyl)-N- (2'-chloro-2- fluorobiphenyl-3-yl)- 4-fluoropyrrolidine-2- carboxamide US10822352, Comp No. 33 | US9796741, cmp No. 33
Type:
Small organic molecule
Emp. Form.:
C34H34ClF2N5O5S
Mol. Mass.:
698.179
SMILES:
CC(=O)c1cn(CC(=O)N2C[C@H](F)C[C@H]2C(=O)Nc2cccc(c2F)-c2ccccc2Cl)c2ccc(cc12)N1CCN(CC1)S(C)(=O)=O
: