Target
Complement factor D
Ligand
BDBM354168
Substrate
Meas. Tech.
Factor D Assay
IC50
>10000±n/a nM
Citation
 Gadhachanda, VRWang, QPais, GHashimoto, AChen, DWang, XAgarwal, ADeshpande, MWiles, JAPhadke, AS Aryl, heteroaryl, and heterocyclic compounds for treatment of complement mediated disorders US Patent  US9796741 Publication Date 10/24/2017 
Target
Name:
Complement factor D
Synonyms:
Adipsin CFAD_HUMAN DF Properdin factor D
Type:
Protein
Mol. Mass.:
27039.19
Organism:
Homo sapiens (Human)
Description:
P00746
Residue:
253
  
Inhibitor
Name:
BDBM354168
Synonyms:
(2S,4R)-1-(2-(3-acetyl- 5-(pyridazin-4-yl)-1H- indol-1-yl)acetyl)-4- fluoro-N-(2-(5-methyl- 1H-pyrazol-1- yl)phenyl)pyrrolidine- 2-carboxamide US10822352, Comp No. 72 | US9796741, cmp No. 72
Type:
Small organic molecule
Emp. Form.:
C31H28FN7O3
Mol. Mass.:
565.5975
SMILES:
CC(=O)c1cn(CC(=O)N2C[C@H](F)C[C@H]2C(=O)Nc2ccccc2-n2nccc2C)c2ccc(cc12)-c1ccnnc1
: