Target
Complement factor D
Ligand
BDBM354205
Substrate
Meas. Tech.
Factor D Assay
IC50
5050±n/a nM
Citation
 Gadhachanda, VRWang, QPais, GHashimoto, AChen, DWang, XAgarwal, ADeshpande, MWiles, JAPhadke, AS Aryl, heteroaryl, and heterocyclic compounds for treatment of complement mediated disorders US Patent  US9796741 Publication Date 10/24/2017 
Target
Name:
Complement factor D
Synonyms:
Adipsin CFAD_HUMAN DF Properdin factor D
Type:
Protein
Mol. Mass.:
27039.19
Organism:
Homo sapiens (Human)
Description:
P00746
Residue:
253
  
Inhibitor
Name:
BDBM354205
Synonyms:
(2S,4R)-1-(2-(3-acetyl- 5-(pyridazin-4-yl)-1H- indol-1-yl)acetyl)-N-(5- bromopyrimidin-2-yl)- 4-fluoropyrrolidine-2- carboxamide US10822352, Comp No. 108 | US9796741, cmp No. 108
Type:
Small organic molecule
Emp. Form.:
C25H21BrFN7O3
Mol. Mass.:
566.382
SMILES:
CC(=O)c1cn(CC(=O)N2C[C@H](F)C[C@H]2C(=O)Nc2ncc(Br)cn2)c2ccc(cc12)-c1ccnnc1
: