Target
Proteinase-activated receptor 4
Ligand
BDBM176070
Substrate
Meas. Tech.
PAR4 FLIPR assay
Temperature
298.15±n/a K
EC50
0.310±n/a nM
Comments
extracted
Citation
 Banville, JRemillard, RRuediger, EHDeon, DHGagnon, MDube, LGuy, JPriestley, ESPosy, SLMaxwell, BDWong, PCLawrence, RMMiller, MM Imidazothiadiazole and imidazopyrazine derivatives as protease activated receptor 4 (PAR4) inhibitors for treating platelet aggregation US Patent  US10047103 Publication Date 8/14/2018 
Target
Name:
Proteinase-activated receptor 4
Synonyms:
Coagulation factor II receptor-like 3 PAR-4 PAR4_HUMAN Proteinase-activated receptor 4 (PAR4) | Thrombin receptor-like 3
Type:
Protein
Mol. Mass.:
41145.16
Organism:
Homo sapiens (Human)
Description:
Q96RI0
Residue:
385
  
Inhibitor
Name:
BDBM176070
Synonyms:
US10047103, 103 | US9688695, 103
Type:
Small organic molecule
Emp. Form.:
C25H25N5O6S2
Mol. Mass.:
555.626
SMILES:
COc1nn2cc(nc2s1)-c1cc2c(OCc3csc(n3)N3CCC4(CC3)OCCO4)cc(OC)cc2o1
: