Target
Prothrombin
Ligand
BDBM175970
Substrate
Meas. Tech.
Platelet Aggregation (PRP) Assay
Temperature
298.15±n/a K
IC50
4.70±n/a nM
Comments
extracted
Citation
 Banville, JRemillard, RRuediger, EHDeon, DHGagnon, MDube, LGuy, JPriestley, ESPosy, SLMaxwell, BDWong, PCLawrence, RMMiller, MM Imidazothiadiazole and imidazopyrazine derivatives as protease activated receptor 4 (PAR4) inhibitors for treating platelet aggregation US Patent  US10047103 Publication Date 8/14/2018 
Target
Name:
Prothrombin
Synonyms:
Activation peptide fragment 1 Coagulation factor II Prothrombin precursor Thrombin heavy chain | Thrombin light chain
Type:
Protein
Mol. Mass.:
70029.57
Organism:
Homo sapiens (Human)
Description:
P00734
Residue:
622
  
Inhibitor
Name:
BDBM175970
Synonyms:
US10047103, 3 US9688695, 3
Type:
Small organic molecule
Emp. Form.:
C24H18N4O4S2
Mol. Mass.:
490.554
SMILES:
COc1nn2cc(nc2s1)-c1cc2c(OCc3csc(n3)-c3ccccc3)cc(OC)cc2o1
: