Target
Prothrombin
Ligand
BDBM175973
Substrate
Meas. Tech.
Platelet Aggregation (PRP) Assay
Temperature
298.15±n/a K
IC50
2034±n/a nM
Comments
extracted
Citation
 Banville, JRemillard, RRuediger, EHDeon, DHGagnon, MDube, LGuy, JPriestley, ESPosy, SLMaxwell, BDWong, PCLawrence, RMMiller, MM Imidazothiadiazole and imidazopyrazine derivatives as protease activated receptor 4 (PAR4) inhibitors for treating platelet aggregation US Patent  US10047103 Publication Date 8/14/2018 
Target
Name:
Prothrombin
Synonyms:
Activation peptide fragment 1 Coagulation factor II Prothrombin precursor Thrombin heavy chain | Thrombin light chain
Type:
Protein
Mol. Mass.:
70029.57
Organism:
Homo sapiens (Human)
Description:
P00734
Residue:
622
  
Inhibitor
Name:
BDBM175973
Synonyms:
US10047103, 6 | US9688695, 6
Type:
Small organic molecule
Emp. Form.:
C22H22N4O6S2
Mol. Mass.:
502.563
SMILES:
COCCOCc1nc(COc2cc(OC)cc3oc(cc23)-c2cn3nc(OC)sc3n2)cs1
: