Target
Prothrombin
Ligand
BDBM176082
Substrate
Meas. Tech.
Platelet Aggregation (PRP) Assay
Temperature
298.15±n/a K
IC50
28.0±n/a nM
Comments
extracted
Citation
 Banville, JRemillard, RRuediger, EHDeon, DHGagnon, MDube, LGuy, JPriestley, ESPosy, SLMaxwell, BDWong, PCLawrence, RMMiller, MM Imidazothiadiazole and imidazopyrazine derivatives as protease activated receptor 4 (PAR4) inhibitors for treating platelet aggregation US Patent  US10047103 Publication Date 8/14/2018 
Target
Name:
Prothrombin
Synonyms:
Activation peptide fragment 1 Coagulation factor II Prothrombin precursor Thrombin heavy chain | Thrombin light chain
Type:
Protein
Mol. Mass.:
70029.57
Organism:
Homo sapiens (Human)
Description:
P00734
Residue:
622
  
Inhibitor
Name:
BDBM176082
Synonyms:
US10047103, 115 | US9688695, 115
Type:
Small organic molecule
Emp. Form.:
C24H22F2N4O4S2
Mol. Mass.:
532.583
SMILES:
COc1nn2cc(nc2s1)-c1cc2c(OCc3csc(n3)C3CCC(F)(F)CC3)cc(OC)cc2o1
: