Target
Carbonic anhydrase 1
Ligand
BDBM16666
Substrate
BDBM11326
Meas. Tech.
Esterase Assay
Ki
66±n/a nM
Citation
 Vullo, DFranchi, MGallori, EAntel, JScozzafava, ASupuran, CT Carbonic anhydrase inhibitors. Inhibition of mitochondrial isozyme V with aromatic and heterocyclic sulfonamides. J Med Chem 47:1272-9 (2004)  
Target
Name:
Carbonic anhydrase 1
Synonyms:
CA-I CAB Carbonate dehydratase I Carbonic anhydrase 1 (CA I) Carbonic anhydrase 1 (Recombinant CA I) Carbonic anhydrase B Carbonic anhydrase I (CA I) Carbonic anhydrase I (CAI) Carbonic anhydrase isoenzyme I (hCA I) | hCA
Type:
Enzyme
Mol. Mass.:
28873.37
Organism:
Homo sapiens (Human)
Description:
P00915
Residue:
261
  
Inhibitor
Name:
BDBM16666
Synonyms:
2-oxo-N-[2-(4-sulfamoylphenyl)ethyl]-2H-chromene-3-carboxamide aromatic sulfonamide compound 31
Type:
Small organic molecule
Emp. Form.:
C18H16N2O5S
Mol. Mass.:
372.395
SMILES:
NS(=O)(=O)c1ccc(CCNC(=O)c2cc3ccccc3oc2=O)cc1
:
Substrate
Name:
BDBM11326
Synonyms:
4-nitrophenyl acetate | p-Nitrophenyl Acetate
Type:
Small organic molecule
Emp. Form.:
C8H7NO4
Mol. Mass.:
181.1455
SMILES:
CC(=O)Oc1ccc(cc1)[N+]([O-])=O
: