Target
Glycogen synthase kinase-3 alpha
Ligand
BDBM354281
Substrate
Meas. Tech.
Enzyme Inhibition Assay
IC50
1445±n/a nM
Citation
 Fyfe, MCKnaggs, MMeghani, PThom, SM Kinase inhibitors US Patent  US9796742 Publication Date 10/24/2017 
Target
Name:
Glycogen synthase kinase-3 alpha
Synonyms:
GSK-3 alpha GSK3A_HUMAN Glycogen synthase kinase-3 Glycogen synthase kinase-3 alpha (GSK3 Alpha) Glycogen synthase kinase-3 alpha (GSK3alpha)
Type:
Enzyme
Mol. Mass.:
50991.79
Organism:
Homo sapiens (Human)
Description:
P49840
Residue:
483
  
Inhibitor
Name:
BDBM354281
Synonyms:
Ethyl (4-(3-(tert-butyl)-5-(3-(4-((2-(phenylamino)pyrimidin-4-yl)oxy)naphthalen-1-yl)-ureido)-1H-pyrazol-1-yl)phenyl)(methyl)phosphinate | US9796742, Example 9
Type:
Small organic molecule
Emp. Form.:
C37H38N7O4P
Mol. Mass.:
675.7159
SMILES:
CCOP(C)(=O)c1ccc(cc1)-n1nc(cc1NC(=O)Nc1ccc(Oc2ccnc(Nc3ccccc3)n2)c2ccccc12)C(C)(C)C
: