Target
Glycogen synthase kinase-3 alpha
Ligand
BDBM354282
Substrate
Meas. Tech.
Enzyme Inhibition Assay
IC50
684±n/a nM
Citation
 Fyfe, MCKnaggs, MMeghani, PThom, SM Kinase inhibitors US Patent  US9796742 Publication Date 10/24/2017 
Target
Name:
Glycogen synthase kinase-3 alpha
Synonyms:
GSK-3 alpha GSK3A_HUMAN Glycogen synthase kinase-3 Glycogen synthase kinase-3 alpha (GSK3 Alpha) Glycogen synthase kinase-3 alpha (GSK3alpha)
Type:
Enzyme
Mol. Mass.:
50991.79
Organism:
Homo sapiens (Human)
Description:
P49840
Residue:
483
  
Inhibitor
Name:
BDBM354282
Synonyms:
1-(4-((2-((1H-Indazol-5-yl)amino)pyrimidin-4-yl)oxy)naphthalen-1-yl)-3-(3-(tert-butyl)-1-(3-(dimethylphosphoryl)phenyl)-1H-pyrazol-5-yl)urea | US9796742, Example 10
Type:
Small organic molecule
Emp. Form.:
C37H36N9O3P
Mol. Mass.:
685.714
SMILES:
CC(C)(C)c1cc(NC(=O)Nc2ccc(Oc3ccnc(Nc4ccc5[nH]ncc5c4)n3)c3ccccc23)n(n1)-c1cccc(c1)P(C)(C)=O
: