Target
Proto-oncogene tyrosine-protein kinase Src
Ligand
BDBM354287
Substrate
Meas. Tech.
Enzyme Inhibition Assay
IC50
>10000±n/a nM
Citation
 Fyfe, MCKnaggs, MMeghani, PThom, SM Kinase inhibitors US Patent  US9796742 Publication Date 10/24/2017 
Target
Name:
Proto-oncogene tyrosine-protein kinase Src
Synonyms:
Calmodulin/Proto-oncogene tyrosine-protein kinase Src Proto-oncogene c-Src SRC SRC_HUMAN V-src sarcoma (Schmidt-Ruppin A-2) viral oncogene homolog (avian) p60-Src | pp60c-src
Type:
Protein
Mol. Mass.:
59838.60
Organism:
Homo sapiens (Human)
Description:
P12931
Residue:
536
  
Inhibitor
Name:
BDBM354287
Synonyms:
1-(3-(tert-Butyl)-1-(4-(dimethylphosphoryl)phenyl)-1H-pyrazol-5-yl)-3-(4-((2-(methyl-(phenyl)amino)pyrimidin-4-yl)oxy)naphthalen-1-yl)urea | US9796742, Example 15
Type:
Small organic molecule
Emp. Form.:
C37H38N7O3P
Mol. Mass.:
659.7165
SMILES:
CN(c1ccccc1)c1nccc(Oc2ccc(NC(=O)Nc3cc(nn3-c3ccc(cc3)P(C)(C)=O)C(C)(C)C)c3ccccc23)n1
: