Target
Proto-oncogene tyrosine-protein kinase Src
Ligand
BDBM354314
Substrate
Meas. Tech.
Enzyme Inhibition Assay
IC50
47.0±n/a nM
Citation
 Fyfe, MCKnaggs, MMeghani, PThom, SM Kinase inhibitors US Patent  US9796742 Publication Date 10/24/2017 
Target
Name:
Proto-oncogene tyrosine-protein kinase Src
Synonyms:
Calmodulin/Proto-oncogene tyrosine-protein kinase Src Proto-oncogene c-Src SRC SRC_HUMAN V-src sarcoma (Schmidt-Ruppin A-2) viral oncogene homolog (avian) p60-Src | pp60c-src
Type:
Protein
Mol. Mass.:
59838.60
Organism:
Homo sapiens (Human)
Description:
P12931
Residue:
536
  
Inhibitor
Name:
BDBM354314
Synonyms:
1-(1-(3-((Dimethylphosphoryl)methyl)phenyl)-3-isopropyl-1H-pyrazol-5-yl)-3-(4-((2-(phenylamino)pyridin-4-yl)oxy)naphthalen-1-yl)urea | US9796742, Example 42
Type:
Small organic molecule
Emp. Form.:
C37H37N6O3P
Mol. Mass.:
644.7018
SMILES:
CC(C)c1cc(NC(=O)Nc2ccc(Oc3ccnc(Nc4ccccc4)c3)c3ccccc23)n(n1)-c1cccc(CP(C)(C)=O)c1
: