Target
Glycogen synthase kinase-3 alpha
Ligand
BDBM354316
Substrate
Meas. Tech.
Enzyme Inhibition Assay
IC50
8039±n/a nM
Citation
 Fyfe, MCKnaggs, MMeghani, PThom, SM Kinase inhibitors US Patent  US9796742 Publication Date 10/24/2017 
Target
Name:
Glycogen synthase kinase-3 alpha
Synonyms:
GSK-3 alpha GSK3A_HUMAN Glycogen synthase kinase-3 Glycogen synthase kinase-3 alpha (GSK3 Alpha) Glycogen synthase kinase-3 alpha (GSK3alpha)
Type:
Enzyme
Mol. Mass.:
50991.79
Organism:
Homo sapiens (Human)
Description:
P49840
Residue:
483
  
Inhibitor
Name:
BDBM354316
Synonyms:
1-(3-(tert-Butyl)-1-(3-((1-oxidophospholan-1-yl)methyl)phenyl)-1H-pyrazol-5-yl)-3-(4-((2-(phenylamino)pyridin-4-yl)oxy)naphthalen-1-yl)urea | US9796742, Example 44
Type:
Small organic molecule
Emp. Form.:
C40H41N6O3P
Mol. Mass.:
684.7657
SMILES:
CC(C)(C)c1cc(NC(=O)Nc2ccc(Oc3ccnc(Nc4ccccc4)c3)c3ccccc23)n(n1)-c1cccc(CP2(=O)CCCC2)c1
: