Target
Ectonucleotide pyrophosphatase/phosphodiesterase family member 2
Ligand
BDBM354357
Substrate
Meas. Tech.
Biochemical Assay
IC50
55±n/a nM
Citation
 Desroy, NHeckmann, BBrys, RCJoncour, AMPeixoto, CBock, XMHousseman, CG Compounds and pharmaceutical compositions thereof for the treatment of inflammatory disorders US Patent  US9796719 Publication Date 10/24/2017 
Target
Name:
Ectonucleotide pyrophosphatase/phosphodiesterase family member 2
Synonyms:
Autotaxin ENPP2_MOUSE Ectonucleotide pyrophosphatase/phosphodiesterase family member 2 Npps2 | Pdnp2
Type:
PROTEIN
Mol. Mass.:
98896.47
Organism:
Mus musculus
Description:
Residue:
862
  
Inhibitor
Name:
BDBM354357
Synonyms:
(S)-2-((2-ethyl-6- (1-(2-(3- hydroxypyrrolidin- 1-yl)-2- oxoethyl)piperidin- 4-yl)imidazo[1,2- a]pyrazin-3- yl)(methyl)amino)- 4-(4- fluorophenyl) thiazole-5- carbonitrile | US9796719, Compound 25
Type:
Small organic molecule
Emp. Form.:
C30H33FN8O2S
Mol. Mass.:
588.699
SMILES:
CCc1nc2cnc(cn2c1N(C)c1nc(c(s1)C#N)-c1ccc(F)cc1)C1CCN(CC(=O)N2CC[C@H](O)C2)CC1
: