Target
Ectonucleotide pyrophosphatase/phosphodiesterase family member 2
Ligand
BDBM354525
Substrate
Meas. Tech.
Biochemical Assay
IC50
55±n/a nM
Citation
 Desroy, NHeckmann, BBrys, RCJoncour, AMPeixoto, CBock, XMHousseman, CG Compounds and pharmaceutical compositions thereof for the treatment of inflammatory disorders US Patent  US9796719 Publication Date 10/24/2017 
Target
Name:
Ectonucleotide pyrophosphatase/phosphodiesterase family member 2
Synonyms:
Autotaxin ENPP2_MOUSE Ectonucleotide pyrophosphatase/phosphodiesterase family member 2 Npps2 | Pdnp2
Type:
PROTEIN
Mol. Mass.:
98896.47
Organism:
Mus musculus
Description:
Residue:
862
  
Inhibitor
Name:
BDBM354525
Synonyms:
N-(2-ethyl-6-(1- (methylsulfonyl)- 1,2,3,6- tetrahydropyridin- 4-yl)imidazo[1,2- b]pyridazin-3-yl)-4- (4-fluorophenyl)-N- methylthiazol-2- amine | US9796719, Compound 194
Type:
Small organic molecule
Emp. Form.:
C24H25FN6O2S2
Mol. Mass.:
512.623
SMILES:
CCc1nc2ccc(nn2c1N(C)c1nc(cs1)-c1ccc(F)cc1)C1=CCN(CC1)S(C)(=O)=O
: