Target
Tyrosine-protein kinase BTK
Ligand
BDBM350319
Substrate
Meas. Tech.
Inhibition Assay
IC50
316±n/a nM
Citation
 Lawson, JDSabat, MScorah, NSmith, CVu, PHWang, H Pyridinyl and fused pyridinyl triazolone derivatives US Patent  US9801872 Publication Date 10/31/2017 
Target
Name:
Tyrosine-protein kinase BTK
Synonyms:
AGMX1 Agammaglobulinaemia tyrosine kinase B cell progenitor kinase BPK BTK_HUMAN Tyrosine Kinase BTK Tyrosine-protein kinase BTK (BTK)
Type:
Enzyme
Mol. Mass.:
76289.95
Organism:
Homo sapiens (Human)
Description:
Q06187
Residue:
659
  
Inhibitor
Name:
BDBM350319
Synonyms:
(R,E)-3-(1-((1-(but-2-enoyl)pyrrolidin-3-yl)oxy)isoquinolin-3-yl)-1H-1,2,4-triazol-5(4H)-one US9801872, Example 3
Type:
Small organic molecule
Emp. Form.:
C19H19N5O3
Mol. Mass.:
365.3859
SMILES:
C\C=C\C(=O)N1CC[C@H](C1)Oc1nc(cc2ccccc12)-c1n[nH]c(=O)[nH]1
: