Target
cAMP and cAMP-inhibited cGMP 3',5'-cyclic phosphodiesterase 10A
Ligand
BDBM197731
Substrate
Meas. Tech.
Inhibition Assay
IC50
240±n/a nM
Citation
 Kehler, JNielsen, JPüschl, AKilburn, JPLanggård, M Quinoline derivatives as PDE10A enzyme inhibitors US Patent  US9801878 Publication Date 10/31/2017 
Target
Name:
cAMP and cAMP-inhibited cGMP 3',5'-cyclic phosphodiesterase 10A
Synonyms:
3',5'-cyclic phosphodiesterase PDE10_HUMAN Phosphodiesterase 10A
Type:
Protein
Mol. Mass.:
88412.52
Organism:
Homo sapiens (Human)
Description:
Q9Y233
Residue:
779
  
Inhibitor
Name:
BDBM197731
Synonyms:
US9216986, 2-[(Z)-2-(5,7-Dimethyl-imidazo[1,2-a]pyrimidin-2-yl)-vinyl]-quinoline | US9801878, 2-[(Z)-2-(5,7-Dimethyl-imidazo[1,2-a]pyrimidin-2-yl)-vinyl]-quinoline
Type:
Small organic molecule
Emp. Form.:
C19H16N4
Mol. Mass.:
300.3571
SMILES:
Cc1cc(C)n2cc(\C=C/c3ccc4ccccc4n3)nc2n1
: