Target
cAMP and cAMP-inhibited cGMP 3',5'-cyclic phosphodiesterase 10A
Ligand
BDBM197751
Substrate
Meas. Tech.
Inhibition Assay
IC50
52.0±n/a nM
Citation
 Kehler, JNielsen, JPüschl, AKilburn, JPLanggård, M Quinoline derivatives as PDE10A enzyme inhibitors US Patent  US9801878 Publication Date 10/31/2017 
Target
Name:
cAMP and cAMP-inhibited cGMP 3',5'-cyclic phosphodiesterase 10A
Synonyms:
3',5'-cyclic phosphodiesterase PDE10_HUMAN Phosphodiesterase 10A
Type:
Protein
Mol. Mass.:
88412.52
Organism:
Homo sapiens (Human)
Description:
Q9Y233
Residue:
779
  
Inhibitor
Name:
BDBM197751
Synonyms:
BDBM197752 US9801878, 2-[2-(5,8-Dimethyl-[1,2,4]triazolo[1,5-a]pyrazin-2-yl)-ethyl]-6-fluoro-quinoline
Type:
Small organic molecule
Emp. Form.:
C18H16FN5
Mol. Mass.:
321.3515
SMILES:
Cc1ncc(C)n2nc(CCc3ccc4cc(F)ccc4n3)nc12
: