Target
Serine/threonine-protein kinase mTOR
Ligand
BDBM222558
Substrate
Meas. Tech.
Kinase Assay
IC50
224±n/a nM
Citation
 Kuo, MLee, YChen, PChen, LJLu, YYHuang, YHsu, HTsai, P Pyrimidine compounds as mTOR and PI3K inhibitors US Patent  US9801888 Publication Date 10/31/2017 
Target
Name:
Serine/threonine-protein kinase mTOR
Synonyms:
FK506-binding protein 12-rapamycin complex-associated protein 1 FRAP FRAP1 MTOR Mammalian Target of Rapamycin (mTOR) RAFT1 Rapamycin and FKBP12 target 1 Serine/threonine-protein kinase (mTOR) | mTORC2
Type:
Rapamycin target protein
Mol. Mass.:
288917.12
Organism:
Homo sapiens (Human)
Description:
P42345
Residue:
2549
  
Inhibitor
Name:
BDBM222558
Synonyms:
US9315491, MTR-0185 | US9801888, Compound MTR-0185
Type:
Small organic molecule
Emp. Form.:
C28H33N7O6S
Mol. Mass.:
595.67
SMILES:
COc1c(nc(nc1C(=O)N1CCN(CC1)S(C)(=O)=O)-c1ccc(NC(=O)Nc2ccccc2)cc1)N1CCOCC1
: