Target
Fibroblast growth factor receptor 2
Ligand
BDBM291236
Substrate
Meas. Tech.
Enzymatic Assay
IC50
<10±n/a nM
Citation
 Lu, LWu, LShen, BYao, W Bicyclic heterocycles as FGFR4 inhibitors US Patent  US9801889 Publication Date 10/31/2017 
Target
Name:
Fibroblast growth factor receptor 2
Synonyms:
BEK FGFR-2 FGFR2 Fibroblast growth factor receptor 2 (FGFR2) KGFR Keratinocyte growth factor receptor VEGF-receptor 2 and Fibroblast growth factor receptor 2
Type:
Enzyme
Mol. Mass.:
92015.45
Organism:
Homo sapiens (Human)
Description:
P21802
Residue:
821
  
Inhibitor
Name:
BDBM291236
Synonyms:
N-(4-(2'-(2,6-difluoro-3,5-dimethoxyphenyl)-3'-oxo-2',3'-dihydro-1'H-spiro[cyclopropane-1,4'-[2,7]naphthyridine]-6'-yl)pyridin-2-yl)acrylamide US9580423, Example 4 | US9801889, Example 4
Type:
Small organic molecule
Emp. Form.:
C26H22F2N4O4
Mol. Mass.:
492.4741
SMILES:
COc1cc(OC)c(F)c(N2Cc3cnc(cc3C3(CC3)C2=O)-c2ccnc(NC(=O)C=C)c2)c1F
: