Target
Fibroblast growth factor receptor 4
Ligand
BDBM291247
Substrate
Meas. Tech.
Enzymatic Assay
IC50
<10±n/a nM
Citation
 Lu, LWu, LShen, BYao, W Bicyclic heterocycles as FGFR4 inhibitors US Patent  US9801889 Publication Date 10/31/2017 
Target
Name:
Fibroblast growth factor receptor 4
Synonyms:
CD_antigen: CD334 FGFR4 FGFR4 Fibroblast growth factor receptor JK2 TKF
Type:
Protein
Mol. Mass.:
87957.45
Organism:
Homo sapiens (Human)
Description:
P22455
Residue:
802
  
Inhibitor
Name:
BDBM291247
Synonyms:
N-(5-(2'-(2,6-difluoro-3,5-dimethoxyphenyl)-3'-oxo-2',3'-dihydro-1'H-spiro[cyclopropane-1,4'-[2,7]naphthyridine]-6'-yl)-1-(2-methoxyethyl)-1H-pyrazol-4-yl)acrylamide US9580423, Example 15 | US9801889, Example 15
Type:
Small organic molecule
Emp. Form.:
C27H27F2N5O5
Mol. Mass.:
539.5306
SMILES:
COCCn1ncc(NC(=O)C=C)c1-c1cc2c(CN(C(=O)C22CC2)c2c(F)c(OC)cc(OC)c2F)cn1
: