Target
Xanthine dehydrogenase/oxidase
Ligand
BDBM352035
Substrate
Meas. Tech.
Inhibition Assay
IC50
1.70±n/a nM
Citation
 Shi, DFu, CWu, JLiu, J 2-aryl selenazole compound and pharmaceutical composition thereof US Patent  US9802907 Publication Date 10/31/2017 
Target
Name:
Xanthine dehydrogenase/oxidase
Synonyms:
XD XDHA XO Xanthine dehydrogenase/oxidase | Xanthine oxidase
Type:
Enzyme
Mol. Mass.:
146441.21
Organism:
Homo sapiens (Human)
Description:
P47989
Residue:
1333
  
Inhibitor
Name:
BDBM352035
Synonyms:
US9802907, Compound 14 US9802907, Compound 35
Type:
Small organic molecule
Emp. Form.:
C18H12N2O2Se
Mol. Mass.:
367.26
SMILES:
Cc1nc([se]c1C(O)=O)-c1ccc(-c2ccccc2)c(c1)C#N
: