Target
Xanthine dehydrogenase/oxidase
Ligand
BDBM352052
Substrate
Meas. Tech.
Inhibition Assay
IC50
1.32±n/a nM
Citation
 Shi, DFu, CWu, JLiu, J 2-aryl selenazole compound and pharmaceutical composition thereof US Patent  US9802907 Publication Date 10/31/2017 
Target
Name:
Xanthine dehydrogenase/oxidase
Synonyms:
XD XDHA XO Xanthine dehydrogenase/oxidase | Xanthine oxidase
Type:
Enzyme
Mol. Mass.:
146441.21
Organism:
Homo sapiens (Human)
Description:
P47989
Residue:
1333
  
Inhibitor
Name:
BDBM352052
Synonyms:
US9802907, Compound 37
Type:
Small organic molecule
Emp. Form.:
C15H14N2O2SSe
Mol. Mass.:
365.31
SMILES:
CC(C)Sc1ccc(cc1C#N)-c1nc(C)c([se]1)C(O)=O
: