Target
Tyrosine-protein kinase BTK
Ligand
BDBM164793
Substrate
Meas. Tech.
Enzyme Assay
IC50
0.100±n/a nM
Citation
 Liu, QWatterson, SHAhmad, STebben, AJ Indole carboxamide compounds US Patent  US9802915 Publication Date 10/31/2017 
Target
Name:
Tyrosine-protein kinase BTK
Synonyms:
AGMX1 Agammaglobulinaemia tyrosine kinase B cell progenitor kinase BPK BTK_HUMAN Tyrosine Kinase BTK Tyrosine-protein kinase BTK (BTK)
Type:
Enzyme
Mol. Mass.:
76289.95
Organism:
Homo sapiens (Human)
Description:
Q06187
Residue:
659
  
Inhibitor
Name:
BDBM164793
Synonyms:
US10604504, Example 232 US9688629, 231 US9802915, Example 232 | US9920031, Example 232
Type:
Small organic molecule
Emp. Form.:
C23H20F3N3O2
Mol. Mass.:
427.419
SMILES:
Cc1[nH]c2c(cc(F)c(-c3cccc4CN(CC(F)(F)c34)C(=O)C=C)c2c1C)C(N)=O
: