Target
Membrane primary amine oxidase
Ligand
BDBM228096
Substrate
Vascular adhesion protein 1 (VAP-1)
Meas. Tech.
Radiochemistry Enzymatic Assay
Temperature
298.15±n/a K
IC50
1.60±n/a nM
Comments
extracted
Citation
 Yoshihara, KSuzuki, DYamaki, SYamada, HMihara, HSeki, N Guanidine compound US Patent  US9556160 Publication Date 1/31/2017 
Target
Name:
Membrane primary amine oxidase
Synonyms:
AOC3_RAT Aoc3 Vascular adhesion protein 1 (VAP-1)
Type:
Enzyme
Mol. Mass.:
84979.78
Organism:
Rattus norvegicus (Rat)
Description:
O08590
Residue:
763
  
Inhibitor
Name:
BDBM228096
Synonyms:
US9556160, ex 557
Type:
Small organic molecule
Emp. Form.:
C19H21FN4O4
Mol. Mass.:
388.3928
SMILES:
Cn1cc(OC2CN(C2)c2cccc(COC(=O)CC(N)=N)c2F)ccc1=O
:
Substrate
Name:
Membrane primary amine oxidase
Synonyms:
AOC3_RAT Aoc3 Vascular adhesion protein 1 (VAP-1)
Type:
Enzyme
Mol. Mass.:
84979.78
Organism:
Rattus norvegicus (Rat)
Description:
O08590
Residue:
763