Target
Membrane primary amine oxidase
Ligand
BDBM228101
Substrate
Vascular adhesion protein 1 (VAP-1)
Meas. Tech.
Radiochemistry Enzymatic Assay
Temperature
298.15±n/a K
IC50
14.0±n/a nM
Comments
extracted
Citation
 Yoshihara, KSuzuki, DYamaki, SYamada, HMihara, HSeki, N Guanidine compound US Patent  US9556160 Publication Date 1/31/2017 
Target
Name:
Membrane primary amine oxidase
Synonyms:
AOC3 Amine oxidase, copper containing Semicarbazide-sensitive amine oxidase/ Vascular adhesion protein 1 (SSAO/VAP-1) Vascular adhesion protein 1 (VAP-1)
Type:
Protein
Mol. Mass.:
84620.86
Organism:
Homo sapiens (Human)
Description:
Q16853
Residue:
763
  
Inhibitor
Name:
BDBM228101
Synonyms:
US9556160, ex 562
Type:
Small organic molecule
Emp. Form.:
C21H29FN4O4
Mol. Mass.:
420.4778
SMILES:
COCC(=O)N1CCC(CC1)C1CN(C1)c1cccc(COC(=O)CC(N)=N)c1F
:
Substrate
Name:
Membrane primary amine oxidase
Synonyms:
AOC3_RAT Aoc3 Vascular adhesion protein 1 (VAP-1)
Type:
Enzyme
Mol. Mass.:
84979.78
Organism:
Rattus norvegicus (Rat)
Description:
O08590
Residue:
763