Target
Serine/threonine-protein kinase pim-2
Ligand
BDBM352092
Substrate
Meas. Tech.
Enzyme Assay
IC50
550±n/a nM
Citation
 Vechorkin, OLi, YZhuo, J Pyridineamine compounds useful as Pim kinase inhibitors US Patent  US9802918 Publication Date 10/31/2017 
Target
Name:
Serine/threonine-protein kinase pim-2
Synonyms:
PIM2 Pim-2h Serine/threonine-protein kinase PIM | Serine/threonine-protein kinase pim-2 (PIM2)
Type:
Serine/threonine-protein kinase
Mol. Mass.:
34185.93
Organism:
Homo sapiens (Human)
Description:
Q9P1W9
Residue:
311
  
Inhibitor
Name:
BDBM352092
Synonyms:
4-((3S,5R)-3-Amino-5-methylpiperidin-1-yl)-N-((5-fluoro-6-(2-fluorophenyl)pyridin-2-yl)methyl)pyridin-3-amine | US9802918, Example 23
Type:
Small organic molecule
Emp. Form.:
C23H25F2N5
Mol. Mass.:
409.4749
SMILES:
C[C@@H]1C[C@H](N)CN(C1)c1ccncc1NCc1ccc(F)c(n1)-c1ccccc1F
: