Target
Serine/threonine-protein kinase pim-1
Ligand
BDBM352139
Substrate
Meas. Tech.
Enzyme Assay
IC50
<10±n/a nM
Citation
 Vechorkin, OLi, YZhuo, J Pyridineamine compounds useful as Pim kinase inhibitors US Patent  US9802918 Publication Date 10/31/2017 
Target
Name:
Serine/threonine-protein kinase pim-1
Synonyms:
PIM-1 Kinase PIM1_HUMAN Serine/threonine-protein kinase (PIM1) Serine/threonine-protein kinase PIM1 | Serine/threonine-protein kinase pim-1 (PIM1)
Type:
Protein
Mol. Mass.:
35681.82
Organism:
Homo sapiens (Human)
Description:
P11309
Residue:
313
  
Inhibitor
Name:
BDBM352139
Synonyms:
4-[(1R,3S,5S)-3-Amino-5-methylcyclohexyl]-N-{[6-(2,6-difluoro-4-morpholin-4-ylphenyl)-5-fluoropyridin-2-yl]methyl}pyridin-3-amine | US9802918, Example 68
Type:
Small organic molecule
Emp. Form.:
C28H32F3N5O
Mol. Mass.:
511.5818
SMILES:
C[C@@H]1C[C@H](N)C[C@@H](C1)c1ccncc1NCc1ccc(F)c(n1)-c1c(F)cc(cc1F)N1CCOCC1
: