Target
Serine/threonine-protein kinase pim-3
Ligand
BDBM352158
Substrate
Meas. Tech.
Enzyme Assay
IC50
<10±n/a nM
Citation
 Vechorkin, OLi, YZhuo, J Pyridineamine compounds useful as Pim kinase inhibitors US Patent  US9802918 Publication Date 10/31/2017 
Target
Name:
Serine/threonine-protein kinase pim-3
Synonyms:
PIM3 Serine/threonine-protein kinase pim-3 (PIM3)
Type:
Protein
Mol. Mass.:
35888.19
Organism:
Homo sapiens (Human)
Description:
Q86V86
Residue:
326
  
Inhibitor
Name:
BDBM352158
Synonyms:
4-[(3R,4R)-3-Amino-4-fluoropiperidin-1-yl]-N-{[6-(2,6-difluorophenyl)-5-fluoropyridin-2-yl]methyl}pyridin-3-amine | US9802918, Example 90
Type:
Small organic molecule
Emp. Form.:
C22H21F4N5
Mol. Mass.:
431.4293
SMILES:
N[C@@H]1CN(CC[C@H]1F)c1ccncc1NCc1ccc(F)c(n1)-c1c(F)cccc1F
: