Target
Serine/threonine-protein kinase pim-1
Ligand
BDBM352172
Substrate
Meas. Tech.
Enzyme Assay
IC50
<10±n/a nM
Citation
 Vechorkin, OLi, YZhuo, J Pyridineamine compounds useful as Pim kinase inhibitors US Patent  US9802918 Publication Date 10/31/2017 
Target
Name:
Serine/threonine-protein kinase pim-1
Synonyms:
PIM-1 Kinase PIM1_HUMAN Serine/threonine-protein kinase (PIM1) Serine/threonine-protein kinase PIM1 | Serine/threonine-protein kinase pim-1 (PIM1)
Type:
Protein
Mol. Mass.:
35681.82
Organism:
Homo sapiens (Human)
Description:
P11309
Residue:
313
  
Inhibitor
Name:
BDBM352172
Synonyms:
4-{2-[({4-[(3R,4R,5S)-3-Amino-4-hydroxy-5-methylpiperidin-1-yl]pyridin-3-yl}amino)methyl]quinolin-7-yl}-3-fluoro-1-methylpyridin-2(1H)-one | US9802918, Example 107
Type:
Small organic molecule
Emp. Form.:
C27H29FN6O2
Mol. Mass.:
488.5566
SMILES:
C[C@H]1CN(C[C@@H](N)[C@@H]1O)c1ccncc1NCc1ccc2ccc(cc2n1)-c1ccn(C)c(=O)c1F
: