Target
Tyrosine-protein kinase BTK
Ligand
BDBM352188
Substrate
Meas. Tech.
TR-FRET (Time Resolved FRET) Assay
IC50
>1000±n/a nM
Citation
 Dominique, RKong, NLou, YLopez-Tapia, FJSo, S Inhibitors of bruton's tyrosine kinase US Patent  US9802920 Publication Date 10/31/2017 
Target
Name:
Tyrosine-protein kinase BTK
Synonyms:
AGMX1 Agammaglobulinaemia tyrosine kinase B cell progenitor kinase BPK BTK_HUMAN Tyrosine Kinase BTK Tyrosine-protein kinase BTK (BTK)
Type:
Enzyme
Mol. Mass.:
76289.95
Organism:
Homo sapiens (Human)
Description:
Q06187
Residue:
659
  
Inhibitor
Name:
BDBM352188
Synonyms:
US9802920, Compound I-12 | [5-Amino-1-(4- cyclopentyloxy-phenyl)-1H- pyrazol-4-yl]-(1H-indol-2- yl)-methanone
Type:
Small organic molecule
Emp. Form.:
C23H22N4O2
Mol. Mass.:
386.4464
SMILES:
Nc1c(cnn1-c1ccc(OC2CCCC2)cc1)C(=O)c1cc2ccccc2[nH]1
: