Target
Vascular endothelial growth factor receptor 3
Ligand
BDBM16673
Substrate
Poly (E:Y)
Meas. Tech.
Time-resolved fluorescence energy transfer assay
pH
7.5±n/a
Temperature
295.15±n/a K
IC50
20±6 nM
Citation
 Wilhelm, SMCarter, CTang, LWilkie, DMcNabola, ARong, HChen, CZhang, XVincent, PMcHugh, MCao, YShujath, JGawlak, SEveleigh, DRowley, BLiu, LAdnane, LLynch, MAuclair, DTaylor, IGedrich, RVoznesensky, ARiedl, BPost, LEBollag, GTrail, PA BAY 43-9006 exhibits broad spectrum oral antitumor activity and targets the RAF/MEK/ERK pathway and receptor tyrosine kinases involved in tumor progression and angiogenesis. Cancer Res 64:7099-109 (2004)  
Target
Name:
Vascular endothelial growth factor receptor 3
Synonyms:
Flt-4 Fms-like tyrosine kinase 4 VEGFR-3 Vegfr3
Type:
Kinase domain
Mol. Mass.:
153007.70
Organism:
Mus musculus (mouse)
Description:
P35917
Residue:
1363
  
Inhibitor
Name:
BDBM16673
Synonyms:
4-[4-({[4-chloro-3-(trifluoromethyl)phenyl]carbamoyl}amino)phenoxy]-N-methylpyridine-2-carboxamide BAY 43-9006 BAY439006 Hit compound, 8 Sorafenib US10183928, Sorafenib US10227329, Compound Sorafenib US10774070, Compound Sorafenib US11279688, Compound Sorafenib US9029401, Sorafenib US9902709, Comparative example 1 cid_216239
Type:
Small organic molecule
Emp. Form.:
C21H16ClF3N4O3
Mol. Mass.:
464.825
SMILES:
CNC(=O)c1cc(Oc2ccc(NC(=O)Nc3ccc(Cl)c(c3)C(F)(F)F)cc2)ccn1
:
Substrate
Name:
Poly (E:Y)
Synonyms:
poly GT-biotin
Type:
Random copolymer
Mol. Mass.:
358.43
Organism:
Description:
Residue:
3
NA