Target
Beta-secretase 1
Ligand
BDBM16678
Substrate
APP_NFEV
Meas. Tech.
BACE Electrochemiluminescence (ECL)-Based Assay
Temperature
310.15±n/a K
IC50
20±n/a nM
Citation
 Stauffer, SRStanton, MGGregro, ARSteinbeiser, MAShaffer, JRNantermet, PGBarrow, JCRittle, KECollusi, DEspeseth, ASLai, MTPietrak, BLHolloway, MKMcGaughey, GBMunshi, SKHochman, JHSimon, AJSelnick, HGGraham, SLVacca, JP Discovery and SAR of isonicotinamide BACE-1 inhibitors that bind beta-secretase in a N-terminal 10s-loop down conformation. Bioorg Med Chem Lett 17:1788-92 (2007)  
Target
Name:
Beta-secretase 1
Synonyms:
ASP2 Aspartyl protease 2 BACE1 Beta-secretase (BACE) Beta-secretase 1 (BACE 1) Beta-secretase 1 (BACE1) Beta-site amyloid precursor protein cleaving enzyme 1 Memapsin-2 beta-Secretase (BACE-1) | beta-Secretase (BACE1)
Type:
Protein
Mol. Mass.:
55755.10
Organism:
Homo sapiens (Human)
Description:
P56817
Residue:
501
  
Inhibitor
Name:
BDBM16678
Synonyms:
Mixture of trans methyl(cyclopropylmethyl)diastereomers. isonicotinamide, 17
Type:
Small organic molecule
Emp. Form.:
C26H39N5O3S
Mol. Mass.:
501.685
SMILES:
CCCC[C@H](N)[C@H](Cc1ccccc1)NC(=O)c1cc(NC[C@H]2C[C@@H]2C)nc(c1)N(C)S(C)(=O)=O
:
Substrate
Name:
APP_NFEV
Synonyms:
Amyloid beta A4 protein precursor beta-site mutant
Type:
Other Protein Type
Mol. Mass.:
86933.39
Organism:
Homo sapiens (Human)
Description:
It is the fusion protein containing the maltose-binding protein at the N-terminal end connected to the full-length APP_NFEV.
Residue:
770