Target
Beta-secretase 1
Ligand
BDBM16684
Substrate
APP_NFEV
Meas. Tech.
BACE Electrochemiluminescence (ECL)-Based Assay
Temperature
310.15±n/a K
IC50
67±n/a nM
Citation
 Stauffer, SRStanton, MGGregro, ARSteinbeiser, MAShaffer, JRNantermet, PGBarrow, JCRittle, KECollusi, DEspeseth, ASLai, MTPietrak, BLHolloway, MKMcGaughey, GBMunshi, SKHochman, JHSimon, AJSelnick, HGGraham, SLVacca, JP Discovery and SAR of isonicotinamide BACE-1 inhibitors that bind beta-secretase in a N-terminal 10s-loop down conformation. Bioorg Med Chem Lett 17:1788-92 (2007)  
Target
Name:
Beta-secretase 1
Synonyms:
ASP2 Aspartyl protease 2 BACE1 Beta-secretase (BACE) Beta-secretase 1 (BACE 1) Beta-secretase 1 (BACE1) Beta-site amyloid precursor protein cleaving enzyme 1 Memapsin-2 beta-Secretase (BACE-1) | beta-Secretase (BACE1)
Type:
Protein
Mol. Mass.:
55755.10
Organism:
Homo sapiens (Human)
Description:
P56817
Residue:
501
  
Inhibitor
Name:
BDBM16684
Synonyms:
N-[(2S,3S)-3-amino-1-phenylbutan-2-yl]-2-[methyl({[(1S,2S)-2-methylcyclopropyl]methyl})amino]-6-(N-propylmethanesulfonamido)pyridine-4-carboxamide | isonicotinamide, 23
Type:
Small organic molecule
Emp. Form.:
C26H39N5O3S
Mol. Mass.:
501.685
SMILES:
CCCN(c1cc(cc(n1)N(C)C[C@H]1C[C@@H]1C)C(=O)N[C@@H](Cc1ccccc1)[C@H](C)N)S(C)(=O)=O
:
Substrate
Name:
APP_NFEV
Synonyms:
Amyloid beta A4 protein precursor beta-site mutant
Type:
Other Protein Type
Mol. Mass.:
86933.39
Organism:
Homo sapiens (Human)
Description:
It is the fusion protein containing the maltose-binding protein at the N-terminal end connected to the full-length APP_NFEV.
Residue:
770