Target
5-hydroxytryptamine receptor 7
Ligand
BDBM352197
Substrate
Meas. Tech.
Radiolabel Binding Assay
IC50
89.0±n/a nM
Citation
 Canney, DJBlass, BEGao, RAbou-Gharbia, M 5-hydroxytryptamine receptor 7 activity modulators and their method of use US Patent  US9802924 Publication Date 10/31/2017 
Target
Name:
5-hydroxytryptamine receptor 7
Synonyms:
5-HT-7 5-HT7 5-HT7S 5HT7 HTR7 | Serotonin receptor 7
Type:
G Protein-Coupled Receptor (GPCR)
Mol. Mass.:
53573.08
Organism:
Homo sapiens (Human)
Description:
P34969
Residue:
479
  
Inhibitor
Name:
BDBM352197
Synonyms:
US10239868, Entry 1 US10676464, Entry 1 | US9802924, Entry 1
Type:
Small organic molecule
Emp. Form.:
C20H30N2O3
Mol. Mass.:
346.4638
SMILES:
CCC1(CC)CC(CCN2CCN(CC2)c2ccc(O)cc2)OC1=O
: