Target
5-hydroxytryptamine receptor 7
Ligand
BDBM352243
Substrate
Meas. Tech.
Radiolabel Binding Assay
IC50
146±n/a nM
Citation
 Canney, DJBlass, BEGao, RAbou-Gharbia, M 5-hydroxytryptamine receptor 7 activity modulators and their method of use US Patent  US9802924 Publication Date 10/31/2017 
Target
Name:
5-hydroxytryptamine receptor 7
Synonyms:
5-HT-7 5-HT7 5-HT7S 5HT7 HTR7 | Serotonin receptor 7
Type:
G Protein-Coupled Receptor (GPCR)
Mol. Mass.:
53573.08
Organism:
Homo sapiens (Human)
Description:
P34969
Residue:
479
  
Inhibitor
Name:
BDBM352243
Synonyms:
US10239868, Entry 46 US10676464, Entry 46 | US9802924, Entry 46
Type:
Small organic molecule
Emp. Form.:
C30H34N2O2
Mol. Mass.:
454.6032
SMILES:
Cc1ccc(cc1)N1CCN(CCCC2CC(C(=O)O2)(c2ccccc2)c2ccccc2)CC1
: