Target
Epidermal growth factor receptor [T790M]
Ligand
BDBM228109
Substrate
Receptor tyrosine-protein kinase erbB-2
Meas. Tech.
Kinase Assay
pH
7.5±n/a
Temperature
298.15±n/a K
IC50
6.20±n/a nM
Comments
extracted
Citation
 Zhang, YLiu, BLiu, JZhang, JCheng, C Aminoquinazoline derivatives and their salts and methods of use thereof US Patent  US9556191 Publication Date 1/31/2017 
Target
Name:
Epidermal growth factor receptor [T790M]
Synonyms:
EGFR ERBB Epidermal growth factor receptor (EGFR) T790M Epidermal growth factor receptor (EGFR)(T790M) HER1
Type:
Enzyme
Mol. Mass.:
134309.68
Organism:
Homo sapiens (Human)
Description:
P00533 (T790M)
Residue:
1210
  
Inhibitor
Name:
BDBM228109
Synonyms:
(e)-n-(4-((3-chloro-4-fluorophenyl)amino)-7-ethoxyquinazolin-6-yl)-4-((4ar,7as)-tetrahydro-2h-[1,4]dioxin[2,3-c]pyrrol-6(3h)-yl)but-2-enamide | US9556191, example 3
Type:
Small organic molecule
Emp. Form.:
C26H27ClFN5O4
Mol. Mass.:
527.975
SMILES:
CCOc1cc2ncnc(Nc3ccc(F)c(Cl)c3)c2cc1NC(=O)\C=C\CN1C[C@H]2OCCO[C@H]2C1
:
Substrate
Name:
Receptor tyrosine-protein kinase erbB-2
Synonyms:
2.7.10.1 CD_antigen=CD340 ERBB2_HUMAN FASN/HER2 HER2 MLN19 NEU Proto-oncogene Neu Tyrosine kinase-type cell surface receptor HER2 | p185erbB2
Type:
Mol. Mass.:
137894.47
Organism:
Homo sapiens (Human)
Description:
P04626
Residue:
1255