Target
Receptor tyrosine-protein kinase erbB-2
Ligand
BDBM228120
Substrate
Receptor tyrosine-protein kinase erbB-2
Meas. Tech.
Kinase Assay
pH
7.5±n/a
Temperature
298.15±n/a K
IC50
2.20±n/a nM
Comments
extracted
Citation
 Zhang, YLiu, BLiu, JZhang, JCheng, C Aminoquinazoline derivatives and their salts and methods of use thereof US Patent  US9556191 Publication Date 1/31/2017 
Target
Name:
Receptor tyrosine-protein kinase erbB-2
Synonyms:
2.7.10.1 CD_antigen=CD340 ERBB2_HUMAN FASN/HER2 HER2 MLN19 NEU Proto-oncogene Neu Tyrosine kinase-type cell surface receptor HER2 | p185erbB2
Type:
Mol. Mass.:
137894.47
Organism:
Homo sapiens (Human)
Description:
P04626
Residue:
1255
  
Inhibitor
Name:
BDBM228120
Synonyms:
(e)-n-(4-((1-(3-fluorobenzyl)-1h-indazol-5-yl)amino)-7-methoxyquinazolin-6-yl)-4-((4ar,7as)-tetra hydro-2h-[1,4]dioxin[2,3-c]pyrrol-6(3h)-yl)but-2-enamide | US9556191, example 27
Type:
Small organic molecule
Emp. Form.:
C33H32FN7O4
Mol. Mass.:
609.6501
SMILES:
COc1cc2ncnc(Nc3ccc4n(Cc5cccc(F)c5)ncc4c3)c2cc1NC(=O)\C=C\CN1C[C@H]2OCCO[C@H]2C1
:
Substrate
Name:
Receptor tyrosine-protein kinase erbB-2
Synonyms:
2.7.10.1 CD_antigen=CD340 ERBB2_HUMAN FASN/HER2 HER2 MLN19 NEU Proto-oncogene Neu Tyrosine kinase-type cell surface receptor HER2 | p185erbB2
Type:
Mol. Mass.:
137894.47
Organism:
Homo sapiens (Human)
Description:
P04626
Residue:
1255