Target
Cathepsin D
Ligand
BDBM16751
Substrate
Cathepsin D/Pepsin Peptide Substrate
Meas. Tech.
FRET-based Peptide Cleavage Assay
pH
4.5±n/a
Temperature
295.15±n/a K
IC50
60000±11400 nM
Citation
 Cole, DCManas, ESStock, JRCondon, JSJennings, LDAulabaugh, AChopra, RCowling, REllingboe, JWFan, KYHarrison, BLHu, YJacobsen, SJin, GLin, LLovering, FEMalamas, MSStahl, MLStrand, JSukhdeo, MNSvenson, KTurner, MJWagner, EWu, JZhou, PBard, J Acylguanidines as small-molecule beta-secretase inhibitors. J Med Chem 49:6158-61 (2006)  
Target
Name:
Cathepsin D
Synonyms:
CATD_HUMAN CTSD Cathepsin D heavy chain Cathepsin D precursor
Type:
Enzyme
Mol. Mass.:
44551.72
Organism:
Homo sapiens (Human)
Description:
Human proCathepsin D (SwissProt accession number P07339) was expressed in Sf9 cells, purified, and autoactivated.
Residue:
412
  
Inhibitor
Name:
BDBM16751
Synonyms:
(N-(diaminomethylene)-2,4-diphenyl-1H-pyrrole-1-acetamide) CHEMBL217068 | N-(diaminomethylidene)-2-(2,5-diphenyl-1H-pyrrol-1-yl)acetamide
Type:
Small organic molecule
Emp. Form.:
C19H18N4O
Mol. Mass.:
318.3724
SMILES:
NC(=N)NC(=O)Cn1c(ccc1-c1ccccc1)-c1ccccc1
:
Substrate
Name:
Cathepsin D/Pepsin Peptide Substrate
Synonyms:
Type:
Peptide
Mol. Mass.:
2478.43
Organism:
Description:
Residue:
21