Target
Cathepsin D
Ligand
BDBM16755
Substrate
Cathepsin D/Pepsin Peptide Substrate
Meas. Tech.
FRET-based Peptide Cleavage Assay
pH
4.5±n/a
Temperature
295.15±n/a K
IC50
5900±300 nM
Citation
 Cole, DCManas, ESStock, JRCondon, JSJennings, LDAulabaugh, AChopra, RCowling, REllingboe, JWFan, KYHarrison, BLHu, YJacobsen, SJin, GLin, LLovering, FEMalamas, MSStahl, MLStrand, JSukhdeo, MNSvenson, KTurner, MJWagner, EWu, JZhou, PBard, J Acylguanidines as small-molecule beta-secretase inhibitors. J Med Chem 49:6158-61 (2006)  
Target
Name:
Cathepsin D
Synonyms:
CATD_HUMAN CTSD Cathepsin D heavy chain Cathepsin D precursor
Type:
Enzyme
Mol. Mass.:
44551.72
Organism:
Homo sapiens (Human)
Description:
Human proCathepsin D (SwissProt accession number P07339) was expressed in Sf9 cells, purified, and autoactivated.
Residue:
412
  
Inhibitor
Name:
BDBM16755
Synonyms:
Acylguanidine, 10d | N-[(1Z)-amino[(3-hydroxypropyl)amino]methylidene]-2-[2-(2-chlorophenyl)-5-(4-propoxyphenyl)-1H-pyrrol-1-yl]acetamide
Type:
Small organic molecule
Emp. Form.:
C25H29ClN4O3
Mol. Mass.:
468.976
SMILES:
CCCOc1ccc(cc1)-c1ccc(-c2ccccc2Cl)n1CC(=O)NC(=N)NCCCO
:
Substrate
Name:
Cathepsin D/Pepsin Peptide Substrate
Synonyms:
Type:
Peptide
Mol. Mass.:
2478.43
Organism:
Description:
Residue:
21