Target
cAMP-dependent protein kinase catalytic subunit alpha
Ligand
BDBM16532
Substrate
biotinylated kemptide
Meas. Tech.
Akt Kinase Assay
IC50
15±n/a nM
Citation
 Zhu, GDGong, JGandhi, VBWoods, KLuo, YLiu, XGuan, RKlinghofer, VJohnson, EFStoll, VSMamo, MLi, QRosenberg, SHGiranda, VL Design and synthesis of pyridine-pyrazolopyridine-based inhibitors of protein kinase B/Akt. Bioorg Med Chem 15:2441-52 (2007)  
Target
Name:
cAMP-dependent protein kinase catalytic subunit alpha
Synonyms:
KAPCA_BOVIN PKC Protein Kinase C cAMP-Dependent Protein Kinase (PKA) cAMP-dependent protein kinase A cAMP-dependent protein kinase, alpha-catalytic subunit
Type:
Enzyme Complex
Mol. Mass.:
40627.77
Organism:
Bos taurus (bovine)
Description:
The PKA holoenzyme purified from bovine heart, exists as an inactive tetrameric complex, which consists of a regulatory dimer associated with two catalytic subunits. It requires cAMP to activate the enzymatic reaction.
Residue:
351
  
Inhibitor
Name:
BDBM16532
Synonyms:
(2S)-1-(1H-indol-3-yl)-3-{[5-(3-methyl-1H-pyrazolo[3,4-c]pyridin-5-yl)pyridin-3-yl]oxy}propan-2-amine pyrazolopyridine analog, 9g | pyrazolopyridine-pyridine, 6
Type:
Small organic molecule
Emp. Form.:
C23H22N6O
Mol. Mass.:
398.4604
SMILES:
Cc1n[nH]c2cnc(cc12)-c1cncc(OC[C@@H](N)Cc2c[nH]c3ccccc23)c1
:
Substrate
Name:
biotinylated kemptide
Synonyms:
Type:
Biotinylated Peptide
Mol. Mass.:
1353.09
Organism:
Description:
Residue:
12
ITINHLRRASLG