Target
Beta-secretase 1
Ligand
BDBM352267
Substrate
Meas. Tech.
HTRF FRET Assay
Ki
6.00±n/a nM
Citation
 Scott, JDCumming, JNBlizzard, TEllis, M C-6 spirocarbocyclic iminothiadiazine dioxides as BACE inhibitors, compositions, and their use US Patent  US9802928 Publication Date 10/31/2017 
Target
Name:
Beta-secretase 1
Synonyms:
ASP2 Aspartyl protease 2 BACE1 Beta-secretase (BACE) Beta-secretase 1 (BACE 1) Beta-secretase 1 (BACE1) Beta-site amyloid precursor protein cleaving enzyme 1 Memapsin-2 beta-Secretase (BACE-1) | beta-Secretase (BACE1)
Type:
Protein
Mol. Mass.:
55755.10
Organism:
Homo sapiens (Human)
Description:
P56817
Residue:
501
  
Inhibitor
Name:
BDBM352267
Synonyms:
US9802928, 1w
Type:
Small organic molecule
Emp. Form.:
C20H20F4N6O4S
Mol. Mass.:
516.469
SMILES:
CN1C(=N)N[C@](C)(c2cc(NC(=O)c3cnc(OCC(F)(F)F)cn3)ccc2F)C2(CC2)S1(=O)=O
: