Target
Coagulation factor XI
Ligand
BDBM142858
Substrate
Meas. Tech.
In Vitro Assay
Ki
34.0±n/a nM
Citation
 Corte, JRFang, TDecicco, CPPinto, DJRossi, KAHu, ZJeon, YQuan, MLSmallheer, JMWang, YYang, W Macrocycles as factor XIa inhibitors US Patent  US9802939 Publication Date 10/31/2017 
Target
Name:
Coagulation factor XI
Synonyms:
Coagulation factor XIa Coagulation factor XIa light chain FA11_HUMAN Factor XIa PTA | Plasma thromboplastin antecedent
Type:
Enzyme
Mol. Mass.:
70130.58
Organism:
Homo sapiens (Human)
Description:
P03951
Residue:
625
  
Inhibitor
Name:
BDBM142858
Synonyms:
US10487086, Example 6 US8940720, 6 | US9802939, 6
Type:
Small organic molecule
Emp. Form.:
C28H29ClN8O3
Mol. Mass.:
561.035
SMILES:
COC(=O)Nc1ccc2-c3c[nH]c(n3)[C@H](CCCCCCc2c1)NC(=O)\C=C\c1cc(Cl)ccc1-n1cnnn1
: