Target
Coagulation factor XI
Ligand
BDBM352296
Substrate
Meas. Tech.
In Vitro Assay
Ki
6.60±n/a nM
Citation
 Corte, JRFang, TDecicco, CPPinto, DJRossi, KAHu, ZJeon, YQuan, MLSmallheer, JMWang, YYang, W Macrocycles as factor XIa inhibitors US Patent  US9802939 Publication Date 10/31/2017 
Target
Name:
Coagulation factor XI
Synonyms:
Coagulation factor XIa Coagulation factor XIa light chain FA11_HUMAN Factor XIa PTA | Plasma thromboplastin antecedent
Type:
Enzyme
Mol. Mass.:
70130.58
Organism:
Homo sapiens (Human)
Description:
P03951
Residue:
625
  
Inhibitor
Name:
BDBM352296
Synonyms:
US9802939, I-57
Type:
Small organic molecule
Emp. Form.:
C27H25F2N7O4
Mol. Mass.:
549.5287
SMILES:
COC(=O)Nc1ccc2-c3c[nH]c(n3)C(C\C=C\C(C)C(=O)Nc2c1)NC(=O)c1c(F)cc2n(C)ncc2c1F
: