Target
Coagulation factor XI
Ligand
BDBM352303
Substrate
Meas. Tech.
In Vitro Assay
Ki
<5.00±n/a nM
Citation
 Corte, JRFang, TDecicco, CPPinto, DJRossi, KAHu, ZJeon, YQuan, MLSmallheer, JMWang, YYang, W Macrocycles as factor XIa inhibitors US Patent  US9802939 Publication Date 10/31/2017 
Target
Name:
Coagulation factor XI
Synonyms:
Coagulation factor XIa Coagulation factor XIa light chain FA11_HUMAN Factor XIa PTA | Plasma thromboplastin antecedent
Type:
Enzyme
Mol. Mass.:
70130.58
Organism:
Homo sapiens (Human)
Description:
P03951
Residue:
625
  
Inhibitor
Name:
BDBM352303
Synonyms:
US9802939, I-80
Type:
Small organic molecule
Emp. Form.:
C33H37ClN10O5
Mol. Mass.:
689.164
SMILES:
COC(=O)Nc1ccc2-c3c[nH]c(n3)[C@H](CCC[C@@H]([C@H](CO)Nc2c1)C(=O)N1CCCC1)NC(=O)\C=C\c1cc(Cl)ccc1-n1cnnn1
: