Target
Coagulation factor XI
Ligand
BDBM142884
Substrate
Meas. Tech.
In Vitro Assay
Ki
1745±n/a nM
Citation
 Corte, JRFang, TDecicco, CPPinto, DJRossi, KAHu, ZJeon, YQuan, MLSmallheer, JMWang, YYang, W Macrocycles as factor XIa inhibitors US Patent  US9802939 Publication Date 10/31/2017 
Target
Name:
Coagulation factor XI
Synonyms:
Coagulation factor XIa Coagulation factor XIa light chain FA11_HUMAN Factor XIa PTA | Plasma thromboplastin antecedent
Type:
Enzyme
Mol. Mass.:
70130.58
Organism:
Homo sapiens (Human)
Description:
P03951
Residue:
625
  
Inhibitor
Name:
BDBM142884
Synonyms:
US10487086, Example I-270 US8940720, I-270 | US9802939, I-270
Type:
Small organic molecule
Emp. Form.:
C28H25ClF2N8O4
Mol. Mass.:
610.999
SMILES:
COC(=O)Nc1ccc2-c3c[nH]c(n3)[C@H](CCCCC(F)(F)C(=O)c2c1)NC(=O)\C=C\c1cc(Cl)ccc1-n1cnnn1
: