Target
Ataxin-2
Ligand
BDBM352369
Substrate
Meas. Tech.
Enzyme Inhibition Assay
IC50
14.0±n/a nM
Citation
 Di Giorgio, PHert, JHunziker, DKuehne, HMattei, PRudolph, M Bicyclic compounds as autotaxin (ATX) and lysophosphatidic acid (LPA) production inhibitors US Patent  US9802944 Publication Date 10/31/2017 
Target
Name:
Ataxin-2
Synonyms:
ATX2 ATXN2 Spinocerebellar ataxia type 2 protein Trinucleotide repeat-containing gene 13 protein
Type:
Mol. Mass.:
140337.65
Organism:
Homo sapiens (Human)
Description:
Q99700
Residue:
1313
  
Inhibitor
Name:
BDBM352369
Synonyms:
US11098048, Example 2.26 | US9802944, Example 2.26
Type:
Small organic molecule
Emp. Form.:
C28H32N6O4
Mol. Mass.:
516.5915
SMILES:
O=C(N1C[C@H]2CN(C[C@H]2C1)C(=O)c1cc(OCC2CCOCC2)nc(c1)C1CC1)c1ccc2[nH]nnc2c1
: