Target
Ataxin-2
Ligand
BDBM352380
Substrate
Meas. Tech.
Enzyme Inhibition Assay
IC50
39.0±n/a nM
Citation
 Di Giorgio, PHert, JHunziker, DKuehne, HMattei, PRudolph, M Bicyclic compounds as autotaxin (ATX) and lysophosphatidic acid (LPA) production inhibitors US Patent  US9802944 Publication Date 10/31/2017 
Target
Name:
Ataxin-2
Synonyms:
ATX2 ATXN2 Spinocerebellar ataxia type 2 protein Trinucleotide repeat-containing gene 13 protein
Type:
Mol. Mass.:
140337.65
Organism:
Homo sapiens (Human)
Description:
Q99700
Residue:
1313
  
Inhibitor
Name:
BDBM352380
Synonyms:
6-(((3aS,6aS)-5-(5-Cyclopropyl-6-(tetrahydro-2H-pyran-4-yloxy)nicotinoyl)hexahydropyrrolo[3,4-c]pyrrol-2(1H)-yl)methyl)benzo[d]oxazol-2(3H)-one US11098048, Example 4 US9802944, Example 4.01
Type:
Small organic molecule
Emp. Form.:
C28H32N4O5
Mol. Mass.:
504.5775
SMILES:
O=C(N1C[C@@H]2CN(Cc3ccc4[nH]c(=O)oc4c3)C[C@H]2C1)c1cnc(OC2CCOCC2)c(c1)C1CC1
: